Coreseek安装失败,求指点

cevin
  • 7k
Distributor ID: Debian
Description:    Debian GNU/Linux 7.6 (wheezy)
Release:    7.6
Codename:   wheezy
sphinxexpr.cpp:1013:43: note: declarations in dependent base ‘Expr_ArgVsSet_c<int>’ are not found by unqualified lookup
sphinxexpr.cpp:1013:43: note: use ‘this->ExprEval’ instead
make[2]: *** [sphinxexpr.o] 错误 1
make[2]: Leaving directory `/root/download/coreseek-3.2.14/csft-3.2.14/src'
make[1]: *** [all] 错误 2
make[1]: Leaving directory `/root/download/coreseek-3.2.14/csft-3.2.14/src'
make: *** [all-recursive] 错误 1
./configure --prefix=/usr/local/sphinx --with-mmseg=/usr/local/mmseg --with-mmseg-includes=/usr/local/mmseg/include/mmseg --with-mmseg-libs=/usr/local/mmseg/lib
回复
阅读 3.2k
宣传栏