用npm安装Node-Sass老是报错是怎么回事?

Ice丶Wing
  • 406

错误代码:
gyp ERR! configure error
gyp ERR! stack Error: Can't find Python executable "python", you can set the PYT
HON env variable.
gyp ERR! stack at PythonFinder.failNoPython (C:Users***AppDataRoami
ngnpmnode_modulesnode-sassnode_modulesnode-gyplibconfigure.js:483:19)
gyp ERR! stack at PythonFinder.<anonymous> (C:Users***AppDataRoamin
gnpmnode_modulesnode-sassnode_modulesnode-gyplibconfigure.js:508:16)
gyp ERR! stack at C:Users***AppDataRoamingnpmnode_modulesnode-sa
ssnode_modulesgraceful-fspolyfills.js:284:29
gyp ERR! stack at FSReqWrap.oncomplete (fs.js:152:21)
gyp ERR! System Windows_NT 6.1.7601
gyp ERR! command "D:\Program Files\nodejs\node.exe" "C:\Users\*\App
Data\Roaming\npm\node_modules\node-sass\node_modules\node-gyp\bin\node-g
yp.js" "rebuild" "--verbose" "--libsass_ext=" "--libsass_cflags=" "--libsass_ldf
lags=" "--libsass_library="
gyp ERR! cwd C:Users***AppDataRoamingnpmnode_modulesnode-sass
gyp ERR! node -v v8.0.0
gyp ERR! node-gyp -v v3.6.2
gyp ERR! not ok
Build failed with error code: 1
npm ERR! code ELIFECYCLE
npm ERR! errno 1
npm ERR! node-sass@4.5.3 postinstall: node scripts/build.js
npm ERR! Exit status 1
npm ERR!
npm ERR! Failed at the node-sass@4.5.3 postinstall script.
npm ERR! This is probably not a problem with npm. There is likely additional log
ging output above.

npm ERR! A complete log of this run can be found in:
npm ERR! C:Users***AppDataRoamingnpm-cache_logs2017-07-06T01_07_
47_983Z-debug.log

求大佬指点,给大佬递茶。公司内网,代理已经配置好,不过我的权限可能有的网站和端口会访问不了,github能上,node.js官网能上,源用的是cnpm。

回复
阅读 12.2k
6 个回答

我昨天也试过安装nodesass失败,后面转用淘宝镜像装就成功了
$ npm install -g cnpm --registry=https://registry.npm.taobao.org (安装淘宝镜像)

$ cnpm install node-sass --save (使用淘宝镜像安装node-sass)

在跟package.json同目录创一个名为.npmrc的文件,然后装个python,最好是2.X版本

把下面这句东西放进去

sass_binary_site=https://npm.taobao.org/mirrors/node-sass/

根目录创建.npmrc

phantomjs_cdnurl=http://cnpmjs.org/downloads
sass_binary_site=https://npm.taobao.org/mirrors/node-sass/
registry=https://registry.npm.taobao.org

保存后 重新npm install

提示是需要安装python,可以安装个python试试,然后配下PYTHON 的环境变量,重新安装试试看。

node-sass需要本地python环境,或者试试cnpm。

你知道吗?

宣传栏