npm install sass-loader --save-dev 总是失败

$ npm install sass-loader --save-dev
npm WARN package.json webpack@1.0.0 No description
npm WARN package.json webpack@1.0.0 No repository field.
npm WARN package.json webpack@1.0.0 No README data
npm WARN peerDependencies The peer dependency node-sass@^3.4.2 included from sass-loader will no
npm WARN peerDependencies longer be automatically installed to fulfill the peerDependency
npm WARN peerDependencies in npm 3+. Your application will need to depend on it explicitly.

spawn-sync@1.0.13 postinstall C:\Users\Administrator\Desktop\webpack\node_modules\node-sass\node_modules\cross-spawn\node_modules\spawn-sync
node postinstall

node-sass@3.4.2 install C:\Users\Administrator\Desktop\webpack\node_modules\node-sass
node scripts/install.js

Cannot download "https://github.com/sass/node-sass/releases/download/v3.4.2/win32-x64-46_binding.node":

socket hang up

Hint: If github.com is not accessible in your location

  try setting a proxy via HTTP_PROXY, e.g.

  export HTTP_PROXY=http://example.com:1234

or configure npm proxy via

  npm config set proxy http://example.com:8080

node-sass@3.4.2 postinstall C:\Users\Administrator\Desktop\webpack\node_modules\node-sass
node scripts/build.js

Building: E:\nodejs\node.exe C:\Users\Administrator\Desktop\webpack\node_modules\node-sass\node_modules\node-gyp\bin\node-gyp.js rebuild --verbose --libsass_ext= --libsass_cflags= --libsass_ldflags= --libsass_library=
gyp info it worked if it ends with ok
gyp verb cli [ 'E:\\nodejs\\node.exe',
gyp verb cli 'C:\\Users\\Administrator\\Desktop\\webpack\\node_modules\\node-sass\\node_modules\\node-gyp\\bin\\node-gyp.js',
gyp verb cli 'rebuild',
gyp verb cli '--verbose',
gyp verb cli '--libsass_ext=',
gyp verb cli '--libsass_cflags=',
gyp verb cli '--libsass_ldflags=',
gyp verb cli '--libsass_library=' ]
gyp info using node-gyp@3.2.1
gyp info using node@4.1.2 | win32 | x64
gyp verb command rebuild []
gyp verb command clean []
gyp verb clean removing "build" directory
gyp verb command configure []
gyp verb check python checking for Python executable "python2.7" in the PATH
gyp verb which failed Error: not found: python2.7
gyp verb which failed at F (C:\Users\Administrator\Desktop\webpack\node_modules\node-sass\node_modules\node-gyp\node_modules\which\which.js:78:19)
gyp verb which failed at E (C:\Users\Administrator\Desktop\webpack\node_modules\node-sass\node_modules\node-gyp\node_modules\which\which.js:82:29)
gyp verb which failed at C:\Users\Administrator\Desktop\webpack\node_modules\node-sass\node_modules\node-gyp\node_modules\which\which.js:93:16
gyp verb which failed at FSReqWrap.oncomplete (fs.js:82:15)
gyp verb which failed python2.7 [Error: not found: python2.7]
gyp verb could not find "python2.7". guessing location
gyp verb ensuring that file exists: C:\Python27\python.exe
gyp ERR! configure error
gyp ERR! stack Error: Can't find Python executable "python2.7", you can set the PYTHON env variable.
gyp ERR! stack at failNoPython (C:\Users\Administrator\Desktop\webpack\node_modules\node-sass\node_modules\node-gyp\lib\configure.js:401:14)
gyp ERR! stack at C:\Users\Administrator\Desktop\webpack\node_modules\node-sass\node_modules\node-gyp\lib\configure.js:356:11
gyp ERR! stack at FSReqWrap.oncomplete (fs.js:82:15)
gyp ERR! System Windows_NT 6.1.7601
gyp ERR! command "E:\\nodejs\\node.exe" "C:\\Users\\Administrator\\Desktop\\webpack\\node_modules\\node-sass\\node_modules\\node-gyp\\bin\\node-gyp.js" "rebuild" "--verbose" "--libsass_ext=" "--libsass_cflags=" "--libsass_ldflags=" "--libsass_library="
gyp ERR! cwd C:\Users\Administrator\Desktop\webpack\node_modules\node-sass
gyp ERR! node -v v4.1.2
gyp ERR! node-gyp -v v3.2.1
gyp ERR! not ok
Build failed
npm ERR! Windows_NT 6.1.7601
npm ERR! argv "E:\\nodejs\\node.exe" "E:\\nodejs\\node_modules\\npm\\bin\\npm-cli.js" "install" "sass-loader" "--save-dev"
npm ERR! node v4.1.2
npm ERR! npm v2.14.4
npm ERR! code ELIFECYCLE

npm ERR! node-sass@3.4.2 postinstall: node scripts/build.js
npm ERR! Exit status 1
npm ERR!
npm ERR! Failed at the node-sass@3.4.2 postinstall script 'node scripts/build.js'.
npm ERR! This is most likely a problem with the node-sass package,
npm ERR! not with npm itself.
npm ERR! Tell the author that this fails on your system:
npm ERR! node scripts/build.js
npm ERR! You can get their info via:
npm ERR! npm owner ls node-sass
npm ERR! There is likely additional logging output above.

npm ERR! Please include the following file with any support request:
npm ERR! C:\Users\Administrator\Desktop\webpack\node_modules\npm-debug.log

阅读 10.8k
评论
    4 个回答
    • 3.6k

    装python2.7,用cnpm安装sass