[!] CocoaPods was not able to update the master repo. If this is an unexpected issue and persists you can inspect it running pod repo update --verbose ? Choose one of the following devices iPhone 7 ios: 11.2 13:56:34 : Buiding project... BUILD FAILED
at checkExecSyncError (child_process.js:601:13)
at Object.execSync (child_process.js:641:13)
at _buildOnSimulator (/Users/devil1/.xtoolkit/node_modules/weexpack/lib/run/ios.js:328:18)
at /Users/devil1/.xtoolkit/node_modules/weexpack/lib/run/ios.js:300:7
at new Promise (<anonymous>)
at buildApp (/Users/devil1/.xtoolkit/node_modules/weexpack/lib/run/ios.js:289:10)
at <anonymous>
at process._tickCallback (internal/process/next_tick.js:188:7)
[!] CocoaPods was not able to update the
master
repo. If this is an unexpected issue and persists you can inspect it runningpod repo update --verbose
? Choose one of the following devices iPhone 7 ios: 11.2
13:56:34 : Buiding project...
BUILD FAILED
The following build commands failed:
(1 failure)
13:56:35 : Error:Error: Command failed: xcodebuild -workspace WeexDemo.xcworkspace -scheme WeexDemo -configuration Debug -destination id=06B2B109-9120-4B22-A75F-9EA791B32D51 -sdk iphonesimulator -derivedDataPath build clean build
BUILD FAILED
The following build commands failed:
(1 failure)