为什么 npm 安装依赖报错 Build failed with error code: 1?

npm ERR! code 1
npm ERR! path D:\桌面\disfile\shouyun-private-network-disk\private-cloud-vue-admin\node_modules\node-sass
npm ERR! command failed
npm ERR! command C:\WINDOWS\system32\cmd.exe /d /s /c node scripts/build.js
npm ERR! Building: E:\Node\node.exe D:\桌面\disfile\shouyun-private-network-disk\private-cloud-vue-admin\node_modules\node-gyp\bin\node-gyp.js rebuild --verbose --libsass_ext= --libsass_cflags= --libsass_ldflags= --libsass_library=
npm ERR! gyp info it worked if it ends with ok
npm ERR! gyp verb cli [
npm ERR! gyp verb cli   'E:\\Node\\node.exe',
npm ERR! gyp verb cli   'D:\\桌面\\disfile\\shouyun-private-network-disk\\private-cloud-vue-admin\\node_modules\\node-gyp\\bin\\node-gyp.js',
npm ERR! gyp verb cli   'rebuild',
npm ERR! gyp verb cli   '--verbose',
npm ERR! gyp verb cli   '--libsass_ext=',
npm ERR! gyp verb cli   '--libsass_cflags=',
npm ERR! gyp verb cli   '--libsass_ldflags=',
npm ERR! gyp verb cli   '--libsass_library='
npm ERR! gyp verb cli ]
npm ERR! gyp info using node-gyp@3.8.0
npm ERR! gyp info using node@16.14.2 | win32 | x64
npm ERR! gyp verb command rebuild []
npm ERR! gyp verb command clean []
npm ERR! gyp verb clean removing "build" directory
npm ERR! gyp verb command configure []
npm ERR! gyp verb check python checking for Python executable "python2" in the PATH
npm ERR! gyp verb `which` failed Error: not found: python2
npm ERR! gyp verb `which` failed     at getNotFoundError (D:\桌面\disfile\shouyun-private-network-disk\private-cloud-vue-admin\node_modules\which\which.js:13:12)     
npm ERR! gyp verb `which` failed     at F (D:\桌面\disfile\shouyun-private-network-disk\private-cloud-vue-admin\node_modules\which\which.js:68:19)
npm ERR! gyp verb `which` failed     at E (D:\桌面\disfile\shouyun-private-network-disk\private-cloud-vue-admin\node_modules\which\which.js:80:29)
npm ERR! gyp verb `which` failed     at D:\桌面\disfile\shouyun-private-network-disk\private-cloud-vue-admin\node_modules\which\which.js:89:16
npm ERR! gyp verb `which` failed     at D:\桌面\disfile\shouyun-private-network-disk\private-cloud-vue-admin\node_modules\isexe\index.js:42:5
npm ERR! gyp verb `which` failed     at D:\桌面\disfile\shouyun-private-network-disk\private-cloud-vue-admin\node_modules\isexe\windows.js:36:5
npm ERR! gyp verb `which` failed     at FSReqCallback.oncomplete (node:fs:198:21)
npm ERR! gyp verb `which` failed  python2 Error: not found: python2
npm ERR! gyp verb `which` failed     at getNotFoundError (D:\桌面\disfile\shouyun-private-network-disk\private-cloud-vue-admin\node_modules\which\which.js:13:12)     
npm ERR! gyp verb `which` failed     at F (D:\桌面\disfile\shouyun-private-network-disk\private-cloud-vue-admin\node_modules\which\which.js:68:19)
npm ERR! gyp verb `which` failed     at E (D:\桌面\disfile\shouyun-private-network-disk\private-cloud-vue-admin\node_modules\which\which.js:80:29)
npm ERR! gyp verb `which` failed     at D:\桌面\disfile\shouyun-private-network-disk\private-cloud-vue-admin\node_modules\which\which.js:89:16
npm ERR! gyp verb `which` failed     at D:\桌面\disfile\shouyun-private-network-disk\private-cloud-vue-admin\node_modules\isexe\index.js:42:5
npm ERR! gyp verb `which` failed     at D:\桌面\disfile\shouyun-private-network-disk\private-cloud-vue-admin\node_modules\isexe\windows.js:36:5
npm ERR! gyp verb `which` failed     at FSReqCallback.oncomplete (node:fs:198:21) {
npm ERR! gyp verb `which` failed   code: 'ENOENT'
npm ERR! gyp verb `which` failed }
npm ERR! gyp verb check python checking for Python executable "python" in the PATH
npm ERR! gyp verb `which` failed Error: not found: python
npm ERR! gyp verb `which` failed     at getNotFoundError (D:\桌面\disfile\shouyun-private-network-disk\private-cloud-vue-admin\node_modules\which\which.js:13:12)     
npm ERR! gyp verb `which` failed     at F (D:\桌面\disfile\shouyun-private-network-disk\private-cloud-vue-admin\node_modules\which\which.js:68:19)
npm ERR! gyp verb `which` failed     at E (D:\桌面\disfile\shouyun-private-network-disk\private-cloud-vue-admin\node_modules\which\which.js:80:29)
npm ERR! gyp verb `which` failed     at D:\桌面\disfile\shouyun-private-network-disk\private-cloud-vue-admin\node_modules\which\which.js:89:16
npm ERR! gyp verb `which` failed     at D:\桌面\disfile\shouyun-private-network-disk\private-cloud-vue-admin\node_modules\isexe\index.js:42:5
npm ERR! gyp verb `which` failed     at D:\桌面\disfile\shouyun-private-network-disk\private-cloud-vue-admin\node_modules\isexe\windows.js:36:5
npm ERR! gyp verb `which` failed     at FSReqCallback.oncomplete (node:fs:198:21)
npm ERR! gyp verb `which` failed  python Error: not found: python
npm ERR! gyp verb `which` failed     at getNotFoundError (D:\桌面\disfile\shouyun-private-network-disk\private-cloud-vue-admin\node_modules\which\which.js:13:12)     
npm ERR! gyp verb `which` failed     at F (D:\桌面\disfile\shouyun-private-network-disk\private-cloud-vue-admin\node_modules\which\which.js:68:19)
npm ERR! gyp verb `which` failed     at E (D:\桌面\disfile\shouyun-private-network-disk\private-cloud-vue-admin\node_modules\which\which.js:80:29)
npm ERR! gyp verb `which` failed     at D:\桌面\disfile\shouyun-private-network-disk\private-cloud-vue-admin\node_modules\which\which.js:89:16
npm ERR! gyp verb `which` failed     at D:\桌面\disfile\shouyun-private-network-disk\private-cloud-vue-admin\node_modules\isexe\index.js:42:5
npm ERR! gyp verb `which` failed     at D:\桌面\disfile\shouyun-private-network-disk\private-cloud-vue-admin\node_modules\isexe\windows.js:36:5
npm ERR! gyp verb `which` failed     at FSReqCallback.oncomplete (node:fs:198:21) {
npm ERR! gyp verb `which` failed   code: 'ENOENT'
npm ERR! gyp verb `which` failed }
npm ERR! gyp verb could not find "python". checking python launcher
npm ERR! gyp verb could not find "python". guessing location
npm ERR! gyp verb ensuring that file exists: C:\Python27\python.exe
npm ERR! gyp ERR! configure error
npm ERR! gyp ERR! stack Error: Can't find Python executable "python", you can set the PYTHON env variable.
npm ERR! gyp ERR! stack     at PythonFinder.failNoPython (D:\桌面\disfile\shouyun-private-network-disk\private-cloud-vue-admin\node_modules\node-gyp\lib\configure.js:484:19)
npm ERR! gyp ERR! stack     at PythonFinder.<anonymous> (D:\桌面\disfile\shouyun-private-network-disk\private-cloud-vue-admin\node_modules\node-gyp\lib\configure.js:509:16)
npm ERR! gyp ERR! stack     at callback (D:\桌面\disfile\shouyun-private-network-disk\private-cloud-vue-admin\node_modules\graceful-fs\polyfills.js:306:20)
npm ERR! gyp ERR! System Windows_NT 10.0.19044
npm ERR! gyp ERR! command "E:\\Node\\node.exe" "D:\\桌面\\disfile\\shouyun-private-network-disk\\private-cloud-vue-admin\\node_modules\\node-gyp\\bin\\node-gyp.js" "rebuild" "--verbose" "--libsass_ext=" "--libsass_cflags=" "--libsass_ldflags=" "--libsass_library="
npm ERR! gyp ERR! cwd D:\桌面\disfile\shouyun-private-network-disk\private-cloud-vue-admin\node_modules\node-sass
npm ERR! gyp ERR! node -v v16.14.2
npm ERR! gyp ERR! node-gyp -v v3.8.0
npm ERR! gyp ERR! not ok
npm ERR! Build failed with error code: 1

npm ERR! A complete log of this run can be found in:
npm ERR!     C:\Users\Hasee\AppData\Local\npm-cache\_logs\2022-11-10T01_00_43_335Z-debug-0.log
阅读 7.6k
3 个回答

安装 Node-Sass 经常会遇到的一个问题,缺失 python 的环境变量了。推荐切换到 Dart-Sass

所以我都是直接推荐大家用 Less 或者 Stylus,减少在这种问题上浪费时间。

使用国内镜像安装 Node-Sass
cnpm install node-sass

配置cnpm的方法可以网上查找下

撰写回答
你尚未登录,登录后可以
  • 和开发者交流问题的细节
  • 关注并接收问题和回答的更新提醒
  • 参与内容的编辑和改进,让解决方法与时俱进
推荐问题