[ 87%] Built target locking_service
Consolidate compiler generated dependencies of target udf_example
[ 87%] Built target udf_example
Consolidate compiler generated dependencies of target mysqld
[ 88%] Built target mysqld
Consolidate compiler generated dependencies of target sqlgunitlib
[ 89%] Built target sqlgunitlib
Consolidate compiler generated dependencies of target mysql_tzinfo_to_sql
[ 89%] Built target mysql_tzinfo_to_sql
[ 90%] Built target GenYaccEmbeddedSource
Consolidate compiler generated dependencies of target sql_embedded
[100%] Built target sql_embedded
Consolidate compiler generated dependencies of target mysqlserver
[100%] Built target mysqlserver
Consolidate compiler generated dependencies of target mysql_client_test_embedded
[100%] Linking CXX executable mysql_client_test_embedded
/bin/ld: ../../archive_output_directory/libmysqld.a: error adding symbols: no more archived files
collect2: error: ld returned 1 exit status
make[2]: *** [libmysqld/examples/CMakeFiles/mysql_client_test_embedded.dir/build.make:98: libmysqld/examples/mysql_client_test_embedded] Error 1
make[1]: *** [CMakeFiles/Makefile2:7115: libmysqld/examples/CMakeFiles/mysql_client_test_embedded.dir/all] Error 2
make: *** [Makefile:166: all] Error 2
chmod: cannot access '/usr/local/mysql-5.7': No such file or directory
chown: cannot access '/usr/local/mysql-5.7': No such file or directory
/root/amh/modules/mysql-5.7/AMHScript: line 117: /usr/local/mysql-5.7/bin/mysqld: No such file or directory
chmod: cannot access '/home/usrdata/mysql-5.7': No such file or directory
chown: cannot access '/home/usrdata/mysql-5.7': No such file or directory
sed: can't read /usr/local/mysql-5.7/support-files/mysql.server: No such file or directory
/root/amh/modules/mysql-5.7/AMHScript: line 121: /usr/local/mysql-5.7/support-files/mysql.server: No such file or directory
/root/amh/modules/mysql-5.7/AMHScript: line 124: /usr/local/mysql-5.7/bin/mysqladmin: No such file or directory
/root/amh/modules/mysql-5.7/AMHScript: line 126: /usr/local/mysql-5.7/bin/mysql: No such file or directory
[Notice] mysql-5.7 is not installed.
==========================================================================
抱歉。安装 AMH 失败了,
如有需要帮助安装,请联系我们: https://amh.sh/bbs/forum.htm
==========================================================================
[root@UZT-Bill amh]#
系统:CentOS Stream release 9
亲,这个是编译出错,先看免编译的版本能否正常安装,再使用命令:
或是取消
EMBEDDED_SERVER
再编译看,使用命令安装: